Target
Leucine-rich repeat serine/threonine-protein kinase 2
Ligand
BDBM410761
Substrate
Meas. Tech.
in vitro peptide-based kinase assay
IC50
<100±n/a nM
Citation
 Hoflack, JBlom, PLavergne, OGomez, S Macrocyclic LRRK2 kinase inhibitors US Patent  US10377772 Publication Date 8/13/2019 
Target
Name:
Leucine-rich repeat serine/threonine-protein kinase 2
Synonyms:
Dardarin LRRK2_HUMAN Leucine-rich repeat serine/threonine-protein kinase 2 PARK8
Type:
Protein
Mol. Mass.:
286113.20
Organism:
Homo sapiens (Human)
Description:
Q5S007
Residue:
2527
  
Inhibitor
Name:
BDBM410761
Synonyms:
US10377772, Compound N62
Type:
Small organic molecule
Emp. Form.:
C24H29FN6O
Mol. Mass.:
436.5251
SMILES:
CC1(C)CN2CCNc3ccn4ncc(-c5cc(OC[C@@H]2CN1C1CC1)ccc5F)c4n3
: