Target
High affinity nerve growth factor receptor
Ligand
BDBM412263
Substrate
Meas. Tech.
Evaluation of Binding Activity for Human TrkA Protein
IC50
<50±n/a nM
Citation
 Saitoh, FNagasue, H Tetrahydronaphthyl urea derivative US Patent  US10399945 Publication Date 9/3/2019 
Target
Name:
High affinity nerve growth factor receptor
Synonyms:
2.7.10.1 NTRK1 NTRK1_HUMAN Neurotrophic tyrosine kinase receptor type 1 Synonyms=MTC TRK1-transforming tyrosine kinase protein TRKA GN Trk-A Tropomyosin-related kinase A Tyrosine kinase receptor Tyrosine kinase receptor A Tyrosine kinase receptor A (Trk-A) gp140trk | p140-TrkA
Type:
Mol. Mass.:
87498.18
Organism:
Homo sapiens (Human)
Description:
P04629
Residue:
796
  
Inhibitor
Name:
BDBM412263
Synonyms:
US10399945, Example 2 US10669239, Compound 7 | US10927079, Compound 7
Type:
Small organic molecule
Emp. Form.:
C25H27N3O2
Mol. Mass.:
401.5008
SMILES:
Cc1cnc(c(NC(=O)N[C@H]2[C@H](O)CC(C)(C)c3ccccc23)c1)-c1ccccc1
: