Target
Interleukin-2
Ligand
BDBM412432
Substrate
Meas. Tech.
Human ELISA assay
IC50
14.0±n/a nM
Citation
 Chen, SBohnert, GJiang, JXia, Z Compounds for inflammation and immune-related uses US Patent  US10399967 Publication Date 9/3/2019 
Target
Name:
Interleukin-2
Synonyms:
IL-2 IL2_HUMAN Interleukin-2 T-cell growth factor | TCGF
Type:
Enzyme
Mol. Mass.:
17630.05
Organism:
Homo sapiens (Human)
Description:
P60568
Residue:
153
  
Inhibitor
Name:
BDBM412432
Synonyms:
N-(5-(2-chloro-5- cyclopropoxyphenyl)pyrazin-2-yl)-4- methylnicotinamide US10399967, Compound 87
Type:
Small organic molecule
Emp. Form.:
C20H17ClN4O2
Mol. Mass.:
380.828
SMILES:
Cc1ccncc1C(=O)Nc1cnc(cn1)-c1cc(OC2CC2)ccc1Cl
: