Target
Interleukin-2
Ligand
BDBM412443
Substrate
Meas. Tech.
Human ELISA assay
IC50
9.00±n/a nM
Citation
 Chen, SBohnert, GJiang, JXia, Z Compounds for inflammation and immune-related uses US Patent  US10399967 Publication Date 9/3/2019 
Target
Name:
Interleukin-2
Synonyms:
IL-2 IL2_HUMAN Interleukin-2 T-cell growth factor | TCGF
Type:
Enzyme
Mol. Mass.:
17630.05
Organism:
Homo sapiens (Human)
Description:
P60568
Residue:
153
  
Inhibitor
Name:
BDBM412443
Synonyms:
5-bromo-N-(5-(5-ethyl-2-(5- methylisoxazol-3-yl)thiazol-4- yl)pyridin-2-yl)-4- methylnicotinamide | US10399967, Compound 73
Type:
Small organic molecule
Emp. Form.:
C21H18BrN5O2S
Mol. Mass.:
484.369
SMILES:
CCc1sc(nc1-c1ccc(NC(=O)c2cncc(Br)c2C)nc1)-c1cc(C)on1
: