Target
Tyrosine-protein kinase JAK3
Ligand
BDBM412674
Substrate
Meas. Tech.
JAK Inhibition Activity Assays
IC50
2.92±0.14 nM
Citation
 Cushman, MSElsayed, MS Janus kinase inhibitors and uses thereof US Patent  US10399979 Publication Date 9/3/2019 
Target
Name:
Tyrosine-protein kinase JAK3
Synonyms:
JAK-3 JAK3_HUMAN Janus kinase 3 (JAK3) L-JAK | Leukocyte janus kinase
Type:
Protein
Mol. Mass.:
125111.08
Organism:
Homo sapiens (Human)
Description:
P52333
Residue:
1124
  
Inhibitor
Name:
BDBM412674
Synonyms:
US10399979, Compound 17a
Type:
Small organic molecule
Emp. Form.:
C22H23N3O3
Mol. Mass.:
377.4363
SMILES:
COc1cc2c3cnc4[nH]ccc4c3n(C3CCCCC3)c(=O)c2cc1OC
: