Target
Mitotic checkpoint serine/threonine-protein kinase BUB1 [704-1085]
Ligand
BDBM415425
Substrate
Meas. Tech.
Kinase Assay
IC50
17.1±n/a nM
Citation
 Graham, KKlar, UBriem, HSchulze, VSiemeister, GLienau, PTempel, RBálint, J 4H-pyrrolo[3,2-C]pyridin-4-one derivatives US Patent  US10428063 Publication Date 10/1/2019 
Target
Name:
Mitotic checkpoint serine/threonine-protein kinase BUB1 [704-1085]
Synonyms:
BUB1 BUB1_HUMAN | Mitotic checkpoint serine/threonine-protein kinase BUB1 (aa 704-1085)
Type:
Mol. Mass.:
43624.72
Organism:
Homo sapiens (Human)
Description:
O43683[704-1085]
Residue:
382
  
Inhibitor
Name:
BDBM415425
Synonyms:
US10428063, Example 25 US20230322767, Example No. 40 WO 2016/120196 WO 2016/120196, Example 40 | rel-(1R,2R)-2-fluoro-N-{4-[5-methyl-4-oxo-3-(phenylamino)-4,5,6,7-tetrahydro-1H-pyrrolo[3,2-c]pyridin-2-yl]pyridin-2-yl}cyclopropanecarboxamide
Type:
Small organic molecule
Emp. Form.:
C23H22FN5O2
Mol. Mass.:
419.4515
SMILES:
CN1CCc2[nH]c(c(Nc3ccccc3)c2C1=O)-c1ccnc(NC(=O)[C@@H]2C[C@@H]2F)c1
: