Target
Mitotic checkpoint serine/threonine-protein kinase BUB1 [704-1085]
Ligand
BDBM415436
Substrate
Meas. Tech.
Kinase Assay
IC50
34.8±n/a nM
Citation
 Graham, KKlar, UBriem, HSchulze, VSiemeister, GLienau, PTempel, RBálint, J 4H-pyrrolo[3,2-C]pyridin-4-one derivatives US Patent  US10428063 Publication Date 10/1/2019 
Target
Name:
Mitotic checkpoint serine/threonine-protein kinase BUB1 [704-1085]
Synonyms:
BUB1 BUB1_HUMAN | Mitotic checkpoint serine/threonine-protein kinase BUB1 (aa 704-1085)
Type:
Mol. Mass.:
43624.72
Organism:
Homo sapiens (Human)
Description:
O43683[704-1085]
Residue:
382
  
Inhibitor
Name:
BDBM415436
Synonyms:
2-(3H-imidazo[4,5-b]pyridin-7-yl)-5-methyl-3-(phenylamino)-1,5,6,7-tetrahydro-4H-pyrrolo[3,2-c]pyridin-4-one | US10428063, Example 36
Type:
Small organic molecule
Emp. Form.:
C20H18N6O
Mol. Mass.:
358.3965
SMILES:
CN1CCc2[nH]c(c(Nc3ccccc3)c2C1=O)-c1ccnc2[nH]cnc12
: