Target
Tyrosine-protein kinase BTK
Ligand
BDBM259427
Substrate
Meas. Tech.
Inhibition of Btk Enzymatic Activity
IC50
0.400±n/a nM
Citation
 Angst, DGessier, FVulpetti, A Amino pyrimidine derivatives US Patent  US10457647 Publication Date 10/29/2019 
Target
Name:
Tyrosine-protein kinase BTK
Synonyms:
AGMX1 Agammaglobulinaemia tyrosine kinase B cell progenitor kinase BPK BTK_HUMAN Tyrosine Kinase BTK Tyrosine-protein kinase BTK (BTK)
Type:
Enzyme
Mol. Mass.:
76289.95
Organism:
Homo sapiens (Human)
Description:
Q06187
Residue:
659
  
Inhibitor
Name:
BDBM259427
Synonyms:
US10457647, Example 26 US11673868, Example 26 | US9512084, 26
Type:
Small organic molecule
Emp. Form.:
C30H31F2N5O4
Mol. Mass.:
563.595
SMILES:
CO[C@@H]1C[C@@H](COc2c(N)ncnc2-c2cc(F)cc(NC(=O)c3ccc(cc3F)C3CC3)c2C)N(C1)C(=O)C=C
: