Target
Catenin beta-1/Protein Wnt-3a
Ligand
BDBM418387
Substrate
Meas. Tech.
Evaluation of Biological Activity
EC50
16.0±n/a nM
Citation
 KC, SKWallace, DMHood, JBarroga, CF γ-diketones as Wnt/β-catenin signaling pathway activators US Patent  US10457672 Publication Date 10/29/2019 
Target
Name:
Catenin beta-1/Protein Wnt-3a
Synonyms:
Wnt/beta-Catenin
Type:
Protein
Mol. Mass.:
Description:
Components:
This complex has 2 components.
Component 1
Name:
Protein Wnt-3a
Synonyms:
WNT3A | WNT3A_HUMAN
Type:
PROTEIN
Mol. Mass.:
39379.02
Organism:
Homo sapiens (Human)
Description:
ChEMBL_1469237
Residue:
352
  
Component 2
Name:
Catenin beta-1
Synonyms:
CTNB1_HUMAN CTNNB1
Type:
PROTEIN
Mol. Mass.:
85484.08
Organism:
Homo sapiens (Human)
Description:
ChEMBL_1504364
Residue:
781
  
Inhibitor
Name:
BDBM418387
Synonyms:
US10457672, Compound 368
Type:
Small organic molecule
Emp. Form.:
C18H16O4
Mol. Mass.:
296.3172
SMILES:
Cc1ccccc1C(=O)CCC(=O)c1ccc2OCOc2c1
: