Target
Interleukin-17A
Ligand
BDBM419234
Substrate
Meas. Tech.
I L-17A Secretion
IC50
<100±n/a nM
Citation
 Musicki, BBouix-Peter, COuvry, GThoreau, E Benzenesulfonamide derivatives as inverse agonists of retinoid-related orphan receptor gamma (RORγ(T)) US Patent  US10457637 Publication Date 10/29/2019 
Target
Name:
Interleukin-17A
Synonyms:
CTLA8 IL-17 IL17A il-17a
Type:
Enzyme Catalytic Domain
Mol. Mass.:
17511.44
Organism:
Homo sapiens (Human)
Description:
Q16552
Residue:
155
  
Inhibitor
Name:
BDBM419234
Synonyms:
N-(4-ethylphenyl)-N- isobutyl-3-(S- methylsulfonimidoyl)-4-(2- oxa-6-azaspiro[3.4]octan-6- yl)benzenesulfonamide | US10457637, Compound 112
Type:
Small organic molecule
Emp. Form.:
C25H35N3O4S2
Mol. Mass.:
505.693
SMILES:
CCc1ccc(cc1)N(CC(C)C)S(=O)(=O)c1ccc(N2CCC3(COC3)C2)c(c1)S(C)(=N)=O
: