Target
Cannabinoid receptor 2
Ligand
BDBM419188
Substrate
Meas. Tech.
Radioligand Binding Assay
Ki
0.800±n/a nM
Citation
 Gobbi, LGrether, UGuba, WKretz, JMartin, REWestphal, MV [1,2,3]triazolo[4,5-d]pyrimidine derivatives US Patent  US10457684 Publication Date 10/29/2019 
Target
Name:
Cannabinoid receptor 2
Synonyms:
CANNABINOID CB2 CB2 CB2B CNR2_HUMAN Cannabinoid CB2 receptor Cannabinoid receptor 2 (CB2R) | hCB2
Type:
G Protein-Coupled Receptor (GPCR)
Mol. Mass.:
39690.94
Organism:
Homo sapiens (Human)
Description:
P34972
Residue:
360
  
Inhibitor
Name:
BDBM419188
Synonyms:
5-[Difluoro(phenyl)methyl]-7-(1,2,5-triazaspiro[2.4]hept-1-en-5-yl)-3-{[2-(trifluoromethyl)phenyl]methyl}-3H-[1,2,3]triazolo[4,5-d]pyrimidine | US10457684, Example 2
Type:
Small organic molecule
Emp. Form.:
C23H17F5N8
Mol. Mass.:
500.4267
SMILES:
FC(F)(F)c1ccccc1Cn1nnc2c(nc(nc12)C(F)(F)c1ccccc1)N1CCC2(C1)N=N2
: