Target
Tyrosine-protein kinase JAK1
Ligand
BDBM419640
Substrate
Meas. Tech.
Caliper Enzyme Assay
IC50
7.00±n/a nM
Citation
 Fensome, AGopalsamy, AGerstenberger, BSEfremov, IVWan, ZPierce, BTelliez, JTrujillo, JIZhang, LXing, LSaiah, E Aminopyrimidinyl compounds US Patent  US10463675 Publication Date 11/5/2019 
Target
Name:
Tyrosine-protein kinase JAK1
Synonyms:
JAK-1 JAK1A JAK1_HUMAN Janus kinase 1 (JAK1) | Janus kinase 1 JAK1
Type:
Protein
Mol. Mass.:
133293.73
Organism:
Homo sapiens (Human)
Description:
P23458
Residue:
1154
  
Inhibitor
Name:
BDBM419640
Synonyms:
US10463675, Example 83 US11197867, Example 83
Type:
Small organic molecule
Emp. Form.:
C20H27N9O2S
Mol. Mass.:
457.552
SMILES:
Cn1cc(Nc2nccc(n2)N2C[C@@H]3CC[C@H](C2)N3C2(CC#N)CN(C2)S(C)(=O)=O)cn1
: