Target
Non-receptor tyrosine-protein kinase TYK2 [580-1182]
Ligand
BDBM387822
Substrate
Meas. Tech.
Enzymatic Inhibition Assay
IC50
4.10±n/a nM
Citation
 Kreutter, KDLeonard, KRizzolio, MCSmith, RCTichenor, MSWang, A Small molecule inhibitors of the JAK family of kinases US Patent  US10487083 Publication Date 11/26/2019 
Target
Name:
Non-receptor tyrosine-protein kinase TYK2 [580-1182]
Synonyms:
TYK2 TYK2_HUMAN
Type:
Mol. Mass.:
68754.63
Organism:
Homo sapiens (Human)
Description:
P29597[580-1182]
Residue:
608
  
Inhibitor
Name:
BDBM387822
Synonyms:
2-(1-((1r,4r)-4-(Cyanomethyl)cyclohexyl)-1,6-dihydroimidazo[4,5-d]pyrrolo[2,3-b]pyridin-2-yl)-N-(tetrahydro-2H-pyran-4-yl)acetamide US10487083, Example 5 US11059823, Example 5
Type:
Small organic molecule
Emp. Form.:
C23H28N6O2
Mol. Mass.:
420.5074
SMILES:
O=C(Cc1nc2cnc3[nH]ccc3c2n1[C@H]1CC[C@H](CC#N)CC1)NC1CCOCC1
: