Target
Replicase polyprotein 1ab
Ligand
BDBM420991
Substrate
Meas. Tech.
IC50 Determination
IC50
4200±200 nM
Citation
 St. John, SEMesecar, AD Broad-spectrum non-covalent coronavirus protease inhibitors US Patent  US9975885 Publication Date 5/22/2018 
Target
Name:
Replicase polyprotein 1ab
Synonyms:
ORF1ab polyprotein pp1ab | rep
Type:
Protein
Mol. Mass.:
795222.79
Organism:
BtCoV
Description:
P0C6W3
Residue:
7119
  
Inhibitor
Name:
BDBM420991
Synonyms:
US9975885, Compound 44
Type:
Small organic molecule
Emp. Form.:
C26H33N5O2
Mol. Mass.:
447.5725
SMILES:
CC(C)(C)CNC(=O)C(N(C(=O)c1c[nH]cn1)c1ccc(cc1)C(C)(C)C)c1cccnc1
: