Target
Poly(ADP-ribose) glycohydrolase
Ligand
BDBM421610
Substrate
Meas. Tech.
PARG Assay
EC50
112±n/a nM
Citation
 McGonagle, AEJordan, AMWaszkowycz, BHutton, CPWaddell, IDHitchin, JRSmith, KMHamilton, NM PARG inhibitory compounds US Patent  US10508086 Publication Date 12/17/2019 
Target
Name:
Poly(ADP-ribose) glycohydrolase
Synonyms:
PARG Poly(ADP-ribose) glycohydrolase | poly(ADP-ribose) glycohydrolase (PARG)
Type:
Protein
Mol. Mass.:
111107.13
Organism:
Homo sapiens (Human)
Description:
Q86W56
Residue:
976
  
Inhibitor
Name:
BDBM421610
Synonyms:
3-[5-(Difluoromethyl)-1,3,4-oxadiazol-2-yl]-1-ethyl-6-fluoro-N-[1-(fluoromethyl)cyclopropyl]-2-oxo-benzimidazole-5-sulfonamide US10995073, Example 200
Type:
Small organic molecule
Emp. Form.:
C16H15F4N5O4S
Mol. Mass.:
449.38
SMILES:
CCn1c2cc(F)c(cc2n(-c2nnc(o2)C(F)F)c1=O)S(=O)(=O)NC1(CF)CC1
: