Target
ADP-ribosylhydrolase ARH3
Ligand
BDBM205480
Substrate
Meas. Tech.
ARH3 Assay
IC50
>100000±n/a nM
Citation
 McGonagle, AEJordan, AMWaszkowycz, BHutton, CPWaddell, IDHitchin, JRSmith, KMHamilton, NM PARG inhibitory compounds US Patent  US10508086 Publication Date 12/17/2019 
Target
Name:
ADP-ribosylhydrolase ARH3
Synonyms:
ADP-ribose glycohydrolase ARH3 ADPRHL2 ADPRS_HUMAN O-acetyl-ADP-ribose deacetylase ARH3 [Protein ADP-ribosylarginine] hydrolase-like protein 2 | [Protein ADP-ribosylserine] hydrolase
Type:
Enzyme Catalytic Domain
Mol. Mass.:
38934.22
Organism:
Homo sapiens (Human)
Description:
Q9NX46
Residue:
363
  
Inhibitor
Name:
BDBM205480
Synonyms:
PDD00017238 (5) US10995073, Example 90
Type:
Small organic molecule
Emp. Form.:
C19H20N6O3S3
Mol. Mass.:
476.595
SMILES:
Cc1nc(C)c(Cn2c3ccc(cc3n(-c3ncns3)c2=O)S(=O)(=O)NC2(C)CC2)s1
: