Target
Sphingosine 1-phosphate receptor 3
Ligand
BDBM427208
Substrate
Meas. Tech.
S1P1 assay
EC50
3330±n/a nM
Citation
 Roberts, ERosen, HBrown, SGuerrero, MAPeng, XPoddutoori, R Modulators of sphingosine phosphate receptors US Patent  US10544136 Publication Date 1/28/2020 
Target
Name:
Sphingosine 1-phosphate receptor 3
Synonyms:
C9orf108 EDG3 S1P receptor 3 S1P3 S1PR3_HUMAN Sphingosine 1-phosphate receptor 3 (S1P3) | Sphingosine 1-phosphate receptor Edg-3
Type:
G Protein-Coupled Receptor (GPCR)
Mol. Mass.:
42278.13
Organism:
Homo sapiens (Human)
Description:
Q99500
Residue:
378
  
Inhibitor
Name:
BDBM427208
Synonyms:
US10544136, Compound 10
Type:
Small organic molecule
Emp. Form.:
C16H15N3O2
Mol. Mass.:
281.3092
SMILES:
CCCOc1ccc(cc1)-c1nc(no1)-c1ccncc1
: