Target
Sphingosine 1-phosphate receptor 1
Ligand
BDBM427213
Substrate
Meas. Tech.
S1P1 assay
EC50
397±n/a nM
Citation
 Roberts, ERosen, HBrown, SGuerrero, MAPeng, XPoddutoori, R Modulators of sphingosine phosphate receptors US Patent  US10544136 Publication Date 1/28/2020 
Target
Name:
Sphingosine 1-phosphate receptor 1
Synonyms:
CHEDG1 Endothelial differentiation G-protein coupled receptor 1 S1P1 S1PR1_HUMAN Sphingosine 1-phosphate receptor Edg-1
Type:
Enzyme
Mol. Mass.:
42836.02
Organism:
Homo sapiens (Human)
Description:
P21453
Residue:
382
  
Inhibitor
Name:
BDBM427213
Synonyms:
US10544136, Compound 18
Type:
Small organic molecule
Emp. Form.:
C13H11N5O3S
Mol. Mass.:
317.323
SMILES:
Nc1cc(ccn1)-c1nc(no1)-c1ccc(cc1)S(N)(=O)=O
: