Target
Sphingosine 1-phosphate receptor 1
Ligand
BDBM427234
Substrate
Meas. Tech.
S1P1 assay
EC50
1180±n/a nM
Citation
 Roberts, ERosen, HBrown, SGuerrero, MAPeng, XPoddutoori, R Modulators of sphingosine phosphate receptors US Patent  US10544136 Publication Date 1/28/2020 
Target
Name:
Sphingosine 1-phosphate receptor 1
Synonyms:
CHEDG1 Endothelial differentiation G-protein coupled receptor 1 S1P1 S1PR1_HUMAN Sphingosine 1-phosphate receptor Edg-1
Type:
Enzyme
Mol. Mass.:
42836.02
Organism:
Homo sapiens (Human)
Description:
P21453
Residue:
382
  
Inhibitor
Name:
BDBM427234
Synonyms:
US10544136, Compound 43
Type:
Small organic molecule
Emp. Form.:
C15H11ClFN3O2
Mol. Mass.:
319.718
SMILES:
COc1cc(ccc1C)-c1noc(n1)-c1cc(F)nc(Cl)c1
: