Target
Replicase polyprotein 1ab
Ligand
BDBM429370
Substrate
Meas. Tech.
No assay is provided
Ki
53±n/a nM
Citation
 Pillaiyar, TWendt, LLManickam, MEaswaran, M The recent outbreaks of human coronaviruses: A medicinal chemistry perspective. Med Res Rev 0:0 (2020)  
Target
Name:
Replicase polyprotein 1ab
Synonyms:
3C-like proteinase 3C-like proteinase (SARS-CoV 3Cpro) 3CLp GFL Guanine-N7 methyltransferase Helicase Leader protein Non-structural protein 10 Non-structural protein 3 Non-structural protein 6 Non-structural protein 8 ORF1ab polyprotein PL2-PRO Pol R1AB_SARS RdRp SARS coronavirus main proteinase nsp1 nsp12 nsp14 nsp16 nsp3 nsp5 nsp7 nsp9 pp1ab | rep
Type:
Protein
Mol. Mass.:
790250.81
Organism:
Human SARS coronavirus (SARS-CoV) (Severe acute respiratory syndrome coronavirus)
Description:
P0C6X7
Residue:
7073
  
Inhibitor
Name:
BDBM429370
Synonyms:
med.21724, Compound 41
Type:
Small Organic Molecule
Emp. Form.:
C33H49N3O7
Mol. Mass.:
599.7581
SMILES:
CC(OC(C)(C)C)[C@H](NC(=O)OCc1ccccc1)C(=O)C[C@@H](CC1CCCCC1)C(=O)N[C@@H](C[C@@H]1CCNC1=O)C=O
: