Target
Protein O-GlcNAcase
Ligand
BDBM430398
Substrate
Meas. Tech.
Inhibition Assay
IC50
<50±n/a nM
Citation
 Quattropani, AKulkarni, SSGiri, AG Glycosidase inhibitors US Patent  US10556902 Publication Date 2/11/2020 
Target
Name:
Protein O-GlcNAcase
Synonyms:
2-acetamido-2-deoxy-β-D-glucopyranosidase (O-GlcNAcase) Beta-hexosaminidase (O-GlcNAcase) HEXC MEA5 N-acetyl-beta-D-glucosaminidase (O-GlcNAcase) OGA Protein O-GlcNAcase
Type:
Enzyme
Mol. Mass.:
102874.67
Organism:
Homo sapiens (Human)
Description:
O60502
Residue:
916
  
Inhibitor
Name:
BDBM430398
Synonyms:
US10556902, No 8 | US11612599, Compound 8
Type:
Small organic molecule
Emp. Form.:
C21H25N7
Mol. Mass.:
375.4701
SMILES:
CC(N1CCN(CC1)c1ncc2CNCCc2n1)c1ccc2nccnc2c1
: