Target
Protein O-GlcNAcase
Ligand
BDBM430405
Substrate
Meas. Tech.
Inhibition Assay
IC50
<50±n/a nM
Citation
 Quattropani, AKulkarni, SSGiri, AG Glycosidase inhibitors US Patent  US10556902 Publication Date 2/11/2020 
Target
Name:
Protein O-GlcNAcase
Synonyms:
2-acetamido-2-deoxy-β-D-glucopyranosidase (O-GlcNAcase) Beta-hexosaminidase (O-GlcNAcase) HEXC MEA5 N-acetyl-beta-D-glucosaminidase (O-GlcNAcase) OGA Protein O-GlcNAcase
Type:
Enzyme
Mol. Mass.:
102874.67
Organism:
Homo sapiens (Human)
Description:
O60502
Residue:
916
  
Inhibitor
Name:
BDBM430405
Synonyms:
US10556902, No 15 | US11612599, Compound 15
Type:
Small organic molecule
Emp. Form.:
C20H26N4OS
Mol. Mass.:
370.512
SMILES:
CC(N1CCN(CC1)c1nc2CCNCc2s1)c1ccc2CCOc2c1
: