Target
Protein O-GlcNAcase
Ligand
BDBM430413
Substrate
Meas. Tech.
Inhibition Assay
IC50
<50±n/a nM
Citation
 Quattropani, AKulkarni, SSGiri, AG Glycosidase inhibitors US Patent  US10556902 Publication Date 2/11/2020 
Target
Name:
Protein O-GlcNAcase
Synonyms:
2-acetamido-2-deoxy-β-D-glucopyranosidase (O-GlcNAcase) Beta-hexosaminidase (O-GlcNAcase) HEXC MEA5 N-acetyl-beta-D-glucosaminidase (O-GlcNAcase) OGA Protein O-GlcNAcase
Type:
Enzyme
Mol. Mass.:
102874.67
Organism:
Homo sapiens (Human)
Description:
O60502
Residue:
916
  
Inhibitor
Name:
BDBM430413
Synonyms:
US10556902, No 23 | US11612599, Compound 23
Type:
Small organic molecule
Emp. Form.:
C18H23N3O2
Mol. Mass.:
313.3941
SMILES:
CC(N1CCC(CC1)c1nnc(C)o1)c1ccc2CCOc2c1
: