Target
Fibroblast growth factor receptor 4
Ligand
BDBM100424
Substrate
Meas. Tech.
Omnia Assay Protocol for Potency Assessment Against FGFR 4 Enzyme
IC50
<500±n/a nM
Citation
 D Agostino, LASjin, RTNiu, DMcDonald, JJZhu, ZLiu, HMazdiyasni, HPetter, RCSingh, JBarrague, MGross, AMunson, MHarvey, DScholte, AManiar, S Substituted pyrido[2,3-d]pyrimidines as inhibitors of protein kinases US Patent  US10618902 Publication Date 4/14/2020 
Target
Name:
Fibroblast growth factor receptor 4
Synonyms:
CD_antigen: CD334 FGFR4 FGFR4 Fibroblast growth factor receptor JK2 TKF
Type:
Protein
Mol. Mass.:
87957.45
Organism:
Homo sapiens (Human)
Description:
P22455
Residue:
802
  
Inhibitor
Name:
BDBM100424
Synonyms:
US10189794, Compound I-217 US10774052, Compound I-217 | US9695132, I-217
Type:
Small organic molecule
Emp. Form.:
C23H26Cl2N6O5
Mol. Mass.:
537.396
SMILES:
CCN1C(=O)N(Cc2cnc(NC3COCC3NC(=O)C=C)nc12)c1c(Cl)c(OC)cc(OC)c1Cl
: