Target
Bromodomain-containing protein 4 [49-170]
Ligand
BDBM438727
Substrate
Meas. Tech.
BRD4 AlphaScreen Assay
IC50
<25±n/a nM
Citation
 Combs, APSparks, RB Tricyclic heterocycles as BET protein inhibitors US Patent  US10618910 Publication Date 4/14/2020 
Target
Name:
Bromodomain-containing protein 4 [49-170]
Synonyms:
BRD4 BRD4-BD1 (aa 49-170) Bromodomain containing 4 (aa 49-170) Bromodomain-containing protein 4 (BRD4)(49-170) HUNK1
Type:
Enzyme Catalytic Domain
Mol. Mass.:
14593.14
Organism:
Homo sapiens (Human)
Description:
aa 49-170 (BRD4-BD1)
Residue:
122
  
Inhibitor
Name:
BDBM438727
Synonyms:
N-{1-[(4S)-7-(3,5-dimethylisoxazol-4-yl)- 4-pyridin-2-yl-4,5-dihydroimidazo[1,5,4- de][1,4]benzoxazin-2-yl]piperidin-4-yl}-N- methylacetamide | US10618910, Example 6
Type:
Small organic molecule
Emp. Form.:
C27H30N6O3
Mol. Mass.:
486.5655
SMILES:
CN(C1CCN(CC1)c1nc2ccc(-c3c(C)noc3C)c3OC[C@H](c4ccccn4)n1c23)C(C)=O
: