Target
Fibroblast growth factor receptor 3
Ligand
BDBM261896
Substrate
Meas. Tech.
Enzymatic Assay
IC50
>200±n/a nM
Citation
 Sokolsky, AWu, LYao, W Bicyclic heterocycles as FGFR4 inhibitors US Patent  US10632126 Publication Date 4/28/2020 
Target
Name:
Fibroblast growth factor receptor 3
Synonyms:
CD_antigen: CD333 FGFR3 Fibroblast growth factor receptor JTK4
Type:
Protein
Mol. Mass.:
87699.57
Organism:
Homo sapiens (Human)
Description:
P22607
Residue:
806
  
Inhibitor
Name:
BDBM261896
Synonyms:
6′-(5-amino-4-fluoro-2-methylphenyl)-2′-(2,6-difluoro-3,5-dimethoxyphenyl)-1′H-spiro[cyclopropane-1,4′-[2,7]naphthyridin]-3′(2′H)-one US10632126, Example 2 US9708318, 2
Type:
Small organic molecule
Emp. Form.:
C25H22F3N3O3
Mol. Mass.:
469.4557
SMILES:
COc1cc(OC)c(F)c(N2Cc3cnc(cc3C3(CC3)C2=O)-c2cc(N)c(F)cc2C)c1F
: