Target
Cyclin-A2/Cyclin-dependent kinase 2
Ligand
BDBM7197
Substrate
Histone H1
Meas. Tech.
Kinase SPA Assay
IC50
18±n/a nM
Citation
 D'Alessio, RBargiotti, AMetz, SBrasca, MGCameron, AErmoli, AMarsiglio, APolucci, PRoletto, FTibolla, MVazquez, MLVulpetti, APevarello, P Benzodipyrazoles: a new class of potent CDK2 inhibitors. Bioorg Med Chem Lett 15:1315-9 (2005)  
Target
Name:
Cyclin-A2/Cyclin-dependent kinase 2
Synonyms:
CDK2-CyclinA CDK2/Cyclin A Cyclin A2/dependent kinase 2 Cyclin-Dependent Kinase 2 (CDK2A)
Type:
Protein Complex
Mol. Mass.:
Description:
Cdk2/Cyclin A kinase was purified from insect cells coinfected with Cyclin A/Cdk2 baculovirus.
Components:
This complex has 2 components.
Component 1
Name:
Cyclin-dependent kinase 2
Synonyms:
CDK2 CDK2_HUMAN Cell division protein kinase 2 Protein cereblon/Cyclin-dependent kinase 2 | p33 protein kinase
Type:
Enzyme Subunit
Mol. Mass.:
33938.17
Organism:
Homo sapiens (Human)
Description:
P24941
Residue:
298
  
Component 2
Name:
Cyclin-A2
Synonyms:
CCN1 CCNA1 CCNA2_HUMAN Cyclin-A
Type:
Enzyme Subunit
Mol. Mass.:
48550.19
Organism:
Homo sapiens (Human)
Description:
P20248
Residue:
432
  
Inhibitor
Name:
BDBM7197
Synonyms:
3-[4-(morpholin-4-yl)phenyl]-3,4,10,11-tetraazatricyclo[7.3.0.0^{2,6}]dodeca-1(9),2(6),4,7,11-pentaene-5-carboxamide | dihydro-benzodipyrazole deriv. 7p
Type:
Small organic molecule
Emp. Form.:
C19H18N6O2
Mol. Mass.:
362.3852
SMILES:
NC(=O)c1nn(-c2ccc(cc2)N2CCOCC2)c2c1ccc1[nH]ncc21
:
Substrate
Name:
Histone H1
Synonyms:
Type:
Other Protein Type
Mol. Mass.:
358.43
Organism:
Bos taurus (bovine)
Description:
Residue:
3
NA