Target
Nuclear receptor ROR-gamma
Ligand
BDBM441821
Substrate
Meas. Tech.
Inhibitory Activity Assay
IC50
2750±n/a nM
Citation
 Wang, YHuang, YYu, FTang, T Biaryl urea derivative or salt thereof and preparation process and use for the same US Patent  US10647665 Publication Date 5/12/2020 
Target
Name:
Nuclear receptor ROR-gamma
Synonyms:
NR1F3 Nuclear receptor ROR-gamma (RORC) RAR-related orphan receptor C (RORc) RORG RZRG Retinoid-related orphan receptor-gamma (RORc)
Type:
Enzyme Catalytic Domain
Mol. Mass.:
58218.40
Organism:
Homo sapiens (Human)
Description:
P51449
Residue:
518
  
Inhibitor
Name:
BDBM441821
Synonyms:
US10647665, Example 1-10 | US10851050, Example I-10
Type:
Small organic molecule
Emp. Form.:
C23H18Cl2F3N3O5S
Mol. Mass.:
576.372
SMILES:
CS(=O)(=O)NC(=O)c1ccc(CNC(=O)Nc2cc(Cl)c(c(Cl)c2)-c2ccccc2OC(F)(F)F)cc1
: