Target
Phosphatidylinositol 4-phosphate 3-kinase C2 domain-containing subunit beta
Ligand
BDBM50059637
Substrate
Meas. Tech.
HTRF In vitro Profiling Assay
IC50
6.31±n/a nM
Citation
 Tedesco, RQu, JSanchez, RRivero, RA Benzimidazole derivatives as PI3 kinase inhibitors US Patent  US10660898 Publication Date 5/26/2020 
Target
Name:
Phosphatidylinositol 4-phosphate 3-kinase C2 domain-containing subunit beta
Synonyms:
C2-PI3K PI3K-C2beta Phosphatidylinositol 4-phosphate 3-kinase C2 beta (PIK3C2B) Phosphoinositide 3-Kinase (PI3K), C2beta PtdIns-3-kinase C2 beta
Type:
Enzyme
Mol. Mass.:
184784.86
Organism:
Homo sapiens (Human)
Description:
O00750
Residue:
1634
  
Inhibitor
Name:
BDBM50059637
Synonyms:
GSK-2636771 US10660898, Example 31
Type:
Small organic molecule
Emp. Form.:
C22H22F3N3O3
Mol. Mass.:
433.4236
SMILES:
Cc1nc2c(cc(cc2n1Cc1cccc(c1C)C(F)(F)F)N1CCOCC1)C(O)=O
: