Target
Sodium channel protein type 8 subunit alpha
Ligand
BDBM373749
Substrate
Meas. Tech.
Electrophysiological Assay
IC50
30.0±n/a nM
Citation
 Andrez, JBurford, KNChowdhury, SCohen, CJDehnhardt, CMDevita, RJEmpfield, JRFocken, TGrimwood, MEHasan, SAJohnson, Jr., JPZenova, AY Benzenesulfonamide compounds and their use as therapeutic agents US Patent  US10662184 Publication Date 5/26/2020 
Target
Name:
Sodium channel protein type 8 subunit alpha
Synonyms:
MED SCN8A_HUMAN Sodium channel protein type 8 subunit alpha Voltage-gated sodium channel subunit alpha Nav1.6 | ep nav1.6
Type:
PROTEIN
Mol. Mass.:
225271.59
Organism:
Homo sapiens (Human)
Description:
ChEMBL_1516902
Residue:
1980
  
Inhibitor
Name:
BDBM373749
Synonyms:
4-(((1R,3s,5S)-8-benzyl-8-azabicyclo[3.2.1]octan-3-yl)oxy)-3-chloro-N-(thiazol-2-yl)benzenesulfonamide US10662184, Example 16 US11299490, Example 16
Type:
Small organic molecule
Emp. Form.:
C23H24ClN3O3S2
Mol. Mass.:
490.038
SMILES:
Clc1cc(ccc1O[C@H]1C[C@@H]2CC[C@H](C1)N2Cc1ccccc1)S(=O)(=O)Nc1nccs1
: