Target
Sodium channel protein type 8 subunit alpha
Ligand
BDBM444508
Substrate
Meas. Tech.
Electrophysiological Assay
IC50
138±n/a nM
Citation
 Andrez, JBurford, KNChowdhury, SCohen, CJDehnhardt, CMDevita, RJEmpfield, JRFocken, TGrimwood, MEHasan, SAJohnson, Jr., JPZenova, AY Benzenesulfonamide compounds and their use as therapeutic agents US Patent  US10662184 Publication Date 5/26/2020 
Target
Name:
Sodium channel protein type 8 subunit alpha
Synonyms:
MED SCN8A_HUMAN Sodium channel protein type 8 subunit alpha Voltage-gated sodium channel subunit alpha Nav1.6 | ep nav1.6
Type:
PROTEIN
Mol. Mass.:
225271.59
Organism:
Homo sapiens (Human)
Description:
ChEMBL_1516902
Residue:
1980
  
Inhibitor
Name:
BDBM444508
Synonyms:
(R)-4-(1-benzylpyrrolidin-3-ylamino)-3-chloro- N-(thiazol-2-yl)benzenesulfonamide | US10662184, Example 79
Type:
Small organic molecule
Emp. Form.:
C19H19ClN4O2S2
Mol. Mass.:
434.963
SMILES:
Clc1cc(ccc1N[C@@H]1CCN(C1)c1ccccc1)S(=O)(=O)Nc1nccs1
: