Target
Vascular endothelial growth factor receptor 2
Ligand
BDBM7238
Substrate
poly(E:Y)
Meas. Tech.
CDK Assay
Temperature
298.15±n/a K
IC50
130±n/a nM
Comments
extracted
Citation
 Li, XHuang, PCui, JJZhang, JTang, C Novel pyrrolyllactone and pyrrolyllactam indolinones as potent cyclin-dependent kinase 2 inhibitors. Bioorg Med Chem Lett 13:1939-42 (2003)  
Target
Name:
Vascular endothelial growth factor receptor 2
Synonyms:
CD_antigen=CD309 Fetal liver kinase 1 (FLK-1) KDR Protein-tyrosine kinase receptor Flk-1 VEGFR-2 VEGFR2 Vascular Endothelial Growth Factor Receptor Kinase 2 Vascular endothelial growth factor receptor 2 (KDR) Vascular endothelial growth factor receptor 2 (VEGFR2) Vascular endothelial growth factor receptor-2 (VEGFR-2)
Type:
Receptor Tyrosine Kinase
Mol. Mass.:
151510.97
Organism:
Homo sapiens (Human)
Description:
P35968
Residue:
1356
  
Inhibitor
Name:
BDBM7238
Synonyms:
(3Z)-3-(1H-imidazol-5-ylmethylidene)-5-methoxy-2,3-dihydro-1H-indol-2-one SU9516 imidazole indolinone driv.
Type:
Small organic molecule
Emp. Form.:
C13H11N3O2
Mol. Mass.:
241.2453
SMILES:
COc1ccc2NC(=O)C(=Cc3cnc[nH]3)c2c1
:
Substrate
Name:
poly(E:Y)
Synonyms:
Type:
Random Polymer
Mol. Mass.:
358.43
Organism:
Description:
a polyGlu-Tyr peptide (4:1)(Sigma P-0275). 10 uM ATP as co-substrate.
Residue:
3
NA