Target
Ataxin-1
Ligand
BDBM446120
Substrate
Meas. Tech.
Human ATX Enzyme Inhibition Assay
IC50
1.000±n/a nM
Citation
 Hert, JHunziker, DMattei, PMauser, HTang, GWang, L Bicyclic derivatives US Patent  US10669268 Publication Date 6/2/2020 
Target
Name:
Ataxin-1
Synonyms:
ATX1 ATXN1 | SCA1
Type:
Protein
Mol. Mass.:
86941.25
Organism:
Homo sapiens (Human)
Description:
P54253
Residue:
815
  
Inhibitor
Name:
BDBM446120
Synonyms:
(E)-1-((3aR,8aS)-2-(1H-benzo[d][1,2,3]triazole-5-carbonyl)octahydropyrrolo[3,4-d]azepin-6(7H)-yl)-3-(3-fluoro-4-(trifluoromethoxy)phenyl)prop-2-en-1-one | US10669268, Example 1.15
Type:
Small organic molecule
Emp. Form.:
C25H23F4N5O3
Mol. Mass.:
517.4754
SMILES:
Fc1cc(\C=C\C(=O)N2CC[C@@H]3CN(C[C@@H]3CC2)C(=O)c2ccc3[nH]nnc3c2)ccc1OC(F)(F)F
: