Target
Ataxin-1
Ligand
BDBM446330
Substrate
Meas. Tech.
Human ATX Enzyme Inhibition Assay
IC50
2.00±n/a nM
Citation
 Hert, JHunziker, DMattei, PMauser, HTang, GWang, L Bicyclic derivatives US Patent  US10669268 Publication Date 6/2/2020 
Target
Name:
Ataxin-1
Synonyms:
ATX1 ATXN1 | SCA1
Type:
Protein
Mol. Mass.:
86941.25
Organism:
Homo sapiens (Human)
Description:
P54253
Residue:
815
  
Inhibitor
Name:
BDBM446330
Synonyms:
(3aS,8aR)-2-(1H-benzotriazole-5-carbonyl)-octahydro-pyrrolo[3,4-d]azepine-6-carboxylic acid 3-fluoro-4-(2,2,2-trifluoro-ethoxy)-benzyl ester | US10669268, Example 1.46
Type:
Small organic molecule
Emp. Form.:
C25H25F4N5O4
Mol. Mass.:
535.4907
SMILES:
Fc1cc(COC(=O)N2CC[C@@H]3CN(C[C@@H]3CC2)C(=O)c2ccc3[nH]nnc3c2)ccc1OCC(F)(F)F
: