Target
Ataxin-1
Ligand
BDBM446430
Substrate
Meas. Tech.
Human ATX Enzyme Inhibition Assay
IC50
2.00±n/a nM
Citation
 Hert, JHunziker, DMattei, PMauser, HTang, GWang, L Bicyclic derivatives US Patent  US10669268 Publication Date 6/2/2020 
Target
Name:
Ataxin-1
Synonyms:
ATX1 ATXN1 | SCA1
Type:
Protein
Mol. Mass.:
86941.25
Organism:
Homo sapiens (Human)
Description:
P54253
Residue:
815
  
Inhibitor
Name:
BDBM446430
Synonyms:
US10669268, Example 19.28 | [(3aS,6aS)-5-[(5R)-4,5,6,7-tetrahydro-1H-benzotriazole-5-carbonyl]-1,3,3a,4,6,6a-hexahydropyrrolo[3,4-c]pyrrol-2-yl]-[1-(2,2,2-trifluoroethoxy)isoquinolin-3-yl]methanone
Type:
Small organic molecule
Emp. Form.:
C25H25F3N6O3
Mol. Mass.:
514.4996
SMILES:
FC(F)(F)COc1nc(cc2ccccc12)C(=O)N1C[C@@H]2CN(C[C@H]2C1)C(=O)[C@@H]1CCc2[nH]nnc2C1
: