Target
Ataxin-1
Ligand
BDBM446431
Substrate
Meas. Tech.
Human ATX Enzyme Inhibition Assay
IC50
1.000±n/a nM
Citation
 Hert, JHunziker, DMattei, PMauser, HTang, GWang, L Bicyclic derivatives US Patent  US10669268 Publication Date 6/2/2020 
Target
Name:
Ataxin-1
Synonyms:
ATX1 ATXN1 | SCA1
Type:
Protein
Mol. Mass.:
86941.25
Organism:
Homo sapiens (Human)
Description:
P54253
Residue:
815
  
Inhibitor
Name:
BDBM446431
Synonyms:
1-[(3aS,6aS)-5-[(5R)-4,5,6,7-tetrahydro-1H-benzotriazole-5-carbonyl]-1,3,3a,4,6,6a-hexahydropyrrolo[3,4-c]pyrrol-2-yl]-2-(4-bromo-2-tert-butylphenoxy)ethanone | US10669268, Example 19.29
Type:
Small organic molecule
Emp. Form.:
C25H32BrN5O3
Mol. Mass.:
530.457
SMILES:
CC(C)(C)c1cc(Br)ccc1OCC(=O)N1C[C@@H]2CN(C[C@H]2C1)C(=O)[C@@H]1CCc2[nH]nnc2C1
: