Target
Tyrosine-protein kinase JAK1 [837-1142]
Ligand
BDBM400366
Substrate
Meas. Tech.
In vitro JAK Kinase Assay
IC50
<5.00±n/a nM
Citation
 Huang, TXue, C Piperidin-4-yl azetidine derivatives as JAK1 inhibitors US Patent  US10695337 Publication Date 6/30/2020 
Target
Name:
Tyrosine-protein kinase JAK1 [837-1142]
Synonyms:
JAK1 JAK1A JAK1_HUMAN Tyrosine-protein kinase JAK1 (837-1142) | Tyrosine-protein kinase JAK1 (aa 837-1142)
Type:
Mol. Mass.:
35230.04
Organism:
Homo sapiens (Human)
Description:
P23458[837-1142]
Residue:
306
  
Inhibitor
Name:
BDBM400366
Synonyms:
US10695337, Example 120 US9999619, Example 121
Type:
Small organic molecule
Emp. Form.:
C31H28FN9O
Mol. Mass.:
561.6121
SMILES:
Fc1cc(ccc1C(=O)N1CCC(CC1)N1CC(CC#N)(C1)n1cc(cn1)-c1ncnc2[nH]ccc12)-c1cccnc1
: