Target
Tyrosine-protein kinase JAK1 [837-1142]
Ligand
BDBM448564
Substrate
Meas. Tech.
In vitro JAK Kinase Assay
IC50
<5.00±n/a nM
Citation
 Huang, TXue, C Piperidin-4-yl azetidine derivatives as JAK1 inhibitors US Patent  US10695337 Publication Date 6/30/2020 
Target
Name:
Tyrosine-protein kinase JAK1 [837-1142]
Synonyms:
JAK1 JAK1A JAK1_HUMAN Tyrosine-protein kinase JAK1 (837-1142) | Tyrosine-protein kinase JAK1 (aa 837-1142)
Type:
Mol. Mass.:
35230.04
Organism:
Homo sapiens (Human)
Description:
P23458[837-1142]
Residue:
306
  
Inhibitor
Name:
BDBM448564
Synonyms:
US10695337, Example 130 {1-[1-(3-fluoro-4-isoquinolin-5- ylbenzoyl)piperidin-4-yl]-3-[4-(7H- pyrrolo[2,3-d]pyrimidin-4-yl)-1H- pyrazol-1-yl]azetidin-3-yl}acetonitrile
Type:
Small organic molecule
Emp. Form.:
C35H30FN9O
Mol. Mass.:
611.6708
SMILES:
Fc1cc(ccc1-c1cccc2cnccc12)C(=O)N1CCC(CC1)N1CC(CC#N)(C1)n1cc(cn1)-c1ncnc2[nH]ccc12
: