Target
Tyrosine-protein kinase JAK1 [837-1142]
Ligand
BDBM400384
Substrate
Meas. Tech.
In vitro JAK Kinase Assay
IC50
<5.00±n/a nM
Citation
 Huang, TXue, C Piperidin-4-yl azetidine derivatives as JAK1 inhibitors US Patent  US10695337 Publication Date 6/30/2020 
Target
Name:
Tyrosine-protein kinase JAK1 [837-1142]
Synonyms:
JAK1 JAK1A JAK1_HUMAN Tyrosine-protein kinase JAK1 (837-1142) | Tyrosine-protein kinase JAK1 (aa 837-1142)
Type:
Mol. Mass.:
35230.04
Organism:
Homo sapiens (Human)
Description:
P23458[837-1142]
Residue:
306
  
Inhibitor
Name:
BDBM400384
Synonyms:
US10695337, Example 139 US9999619, Example 139 | US9999619, Example 140
Type:
Small organic molecule
Emp. Form.:
C28H26F2N8O
Mol. Mass.:
528.5558
SMILES:
Fc1ccc(cc1F)C(=O)N1C2CCC1CC(C2)N1CC(CC#N)(C1)n1cc(cn1)-c1ncnc2[nH]ccc12
: