Target
Toll-like receptor 7
Ligand
BDBM450046
Substrate
Meas. Tech.
Inhibition of the Activation Assay
IC50
10.00±n/a nM
Citation
 Tojo, SIsobe, YIdeue, EFujiwara, HUrabe, D Substituted purine derivative US Patent  US10703755 Publication Date 7/7/2020 
Target
Name:
Toll-like receptor 7
Synonyms:
ORF Names:UNQ248/PRO285 TLR7_HUMAN | Toll-like receptor 7 (TLR7)
Type:
Enzyme
Mol. Mass.:
120945.35
Organism:
Homo sapiens (Human)
Description:
Q9NYK1
Residue:
1049
  
Inhibitor
Name:
BDBM450046
Synonyms:
9-{[1-(1-Azabicyclo[2.2.2]oct-3-ylmethyl)-1H-pyrazol-4-yl]methyl}-2-ethoxy-8-(5-fluoropyridin-3-yl)-6-methyl-9H-purine | US10703755, Example 163
Type:
Small organic molecule
Emp. Form.:
C25H29FN8O
Mol. Mass.:
476.5492
SMILES:
CCOc1nc(C)c2nc(-c3cncc(F)c3)n(Cc3cnn(CC4CN5CCC4CC5)c3)c2n1
: