Target
Toll-like receptor 7
Ligand
BDBM450103
Substrate
Meas. Tech.
Inhibition of the Activation Assay
IC50
3.00±n/a nM
Citation
 Tojo, SIsobe, YIdeue, EFujiwara, HUrabe, D Substituted purine derivative US Patent  US10703755 Publication Date 7/7/2020 
Target
Name:
Toll-like receptor 7
Synonyms:
ORF Names:UNQ248/PRO285 TLR7_HUMAN | Toll-like receptor 7 (TLR7)
Type:
Enzyme
Mol. Mass.:
120945.35
Organism:
Homo sapiens (Human)
Description:
Q9NYK1
Residue:
1049
  
Inhibitor
Name:
BDBM450103
Synonyms:
US10703755, Example 284
Type:
Small organic molecule
Emp. Form.:
C26H28F2N6O
Mol. Mass.:
478.5369
SMILES:
CCN1CCC(CC1)c1ccc(Cn2c(nc3c(C)nc(OC)nc23)-c2cncc(F)c2)c(F)c1
: