Target
Toll-like receptor 7
Ligand
BDBM450120
Substrate
Meas. Tech.
Inhibition of the Activation Assay
IC50
7.00±n/a nM
Citation
 Tojo, SIsobe, YIdeue, EFujiwara, HUrabe, D Substituted purine derivative US Patent  US10703755 Publication Date 7/7/2020 
Target
Name:
Toll-like receptor 7
Synonyms:
ORF Names:UNQ248/PRO285 TLR7_HUMAN | Toll-like receptor 7 (TLR7)
Type:
Enzyme
Mol. Mass.:
120945.35
Organism:
Homo sapiens (Human)
Description:
Q9NYK1
Residue:
1049
  
Inhibitor
Name:
BDBM450120
Synonyms:
US10703755, Example 303
Type:
Small organic molecule
Emp. Form.:
C26H27FN6O
Mol. Mass.:
458.5306
SMILES:
COc1nc(C)c2nc(-c3cccnc3)n(Cc3ccc(cc3F)C3CN4CCC3CC4)c2n1
: