Target
Toll-like receptor 7
Ligand
BDBM450167
Substrate
Meas. Tech.
Inhibition of the Activation Assay
IC50
11.0±n/a nM
Citation
 Tojo, SIsobe, YIdeue, EFujiwara, HUrabe, D Substituted purine derivative US Patent  US10703755 Publication Date 7/7/2020 
Target
Name:
Toll-like receptor 7
Synonyms:
ORF Names:UNQ248/PRO285 TLR7_HUMAN | Toll-like receptor 7 (TLR7)
Type:
Enzyme
Mol. Mass.:
120945.35
Organism:
Homo sapiens (Human)
Description:
Q9NYK1
Residue:
1049
  
Inhibitor
Name:
BDBM450167
Synonyms:
US10703755, Example 364
Type:
Small organic molecule
Emp. Form.:
C26H25FN6O
Mol. Mass.:
456.5147
SMILES:
COc1nc(C)c2nc(-c3cncc(F)c3)n(Cc3cccc(c3)C3=CN4CCC3CC4)c2n1
: