Target
Induced myeloid leukemia cell differentiation protein Mcl-1
Ligand
BDBM451117
Substrate
Meas. Tech.
Exemplary MCL-1 Inhibitors Bind MCL-1 in the presence of 10% HS
Ki
0.020±n/a nM
Citation
 Judd, ASKunzer, ARLai, CSouers, AJTao, ZMastracchio, AWang, XJi, CWendt, MDSong, XDoherty, GAPenning, TD Macrocyclic MCL-1 inhibitors and methods of use US Patent  US10676485 Publication Date 6/9/2020 
Target
Name:
Induced myeloid leukemia cell differentiation protein Mcl-1
Synonyms:
BCL2L3 Bcl-2-like protein 3 (Mcl-1) Bcl2-L-3 MCL1 Mcl-1 Myeloid cell leukemia sequence 1 (BCL2-related) | mcl1/EAT
Type:
Membrane; Single-pass membrane protein
Mol. Mass.:
37332.87
Organism:
Homo sapiens (Human)
Description:
Q07820
Residue:
350
  
Inhibitor
Name:
BDBM451117
Synonyms:
US10676485, Example 27
Type:
Small organic molecule
Emp. Form.:
C47H46Cl2N6O9S
Mol. Mass.:
941.874
SMILES:
COc1ccccc1-c1nccc(COc2ccc3OC[C@@H](CN4CCN(C)CC4)Oc4c(Cl)c(C)c(-c5c(sc6ncnc(O[C@H](Cc2c3)C(O)=O)c56)C2=COCCO2)c(C)c4Cl)n1
: