Target
Programmed cell death 1 ligand 1 [19-238]/protein 1 [25-167]
Ligand
BDBM452008
Substrate
Meas. Tech.
Biochemical Protein-Protein Interaction Assay
IC50
0.060±n/a nM
Citation
Target
Name:
Programmed cell death 1 ligand 1 [19-238]/protein 1 [25-167]
Synonyms:
PD-1/PD-L1
Type:
Protein
Mol. Mass.:
Description:
Components:
This complex has 2 components.
Component 1
Name:
Programmed cell death protein 1 [25-167]
Synonyms:
PD1 PDCD1_HUMAN Programmed cell death protein 1 (aa25-167) hPD-1
Type:
Enzyme Catalytic Domain
Mol. Mass.:
15954.64
Organism:
Homo sapiens (Human)
Description:
Q15116 (aa25-167)
Residue:
143
  
Component 2
Name:
Programmed cell death 1 ligand 1 [19-238]
Synonyms:
B7H1 PD-L1 PDCD1 ligand 1 PDCD1LG1 Programmed cell death 1 ligand 1 (aa19-238) hPD-L1
Type:
Enzyme Catalytic Domain
Mol. Mass.:
25191.31
Organism:
Homo sapiens (Human)
Description:
Q9NZQ7 (aa19-238)
Residue:
220
  
Inhibitor
Name:
BDBM452008
Synonyms:
US10710986, Example 148 | US11555029, No. 148
Type:
Small organic molecule
Emp. Form.:
C34H38Cl2N6O4
Mol. Mass.:
665.609
SMILES:
COc1nc(cnc1CN1CC(C)(CO)C1)-c1cccc(c1Cl)-c1cccc(c1Cl)-c1cnc(CN2CC(C)(CO)C2)c(OC)n1
: