Target
ATR-interacting protein
Ligand
BDBM453139
Substrate
Meas. Tech.
ATR Activity Assay
IC50
5.07±n/a nM
Citation
 Lücking, UKoppitz, MLefranc, JWortmann, LWengner, AMSiemeister, GBömer, UBader, BLienau, PSchick, H 5-substituted 2-(morpholin-4-yl)-1,7-naphthyridines US Patent  US10729680 Publication Date 8/4/2020 
Target
Name:
ATR-interacting protein
Synonyms:
AGS1 ATR-interacting protein (ATRIP) ATRIP_HUMAN
Type:
Enzyme Catalytic Domain
Mol. Mass.:
85833.30
Organism:
Homo sapiens (Human)
Description:
Q8WXE1
Residue:
791
  
Inhibitor
Name:
BDBM453139
Synonyms:
4-(2-chloro-1-methyl-1H-imidazol-5-yl)-5-methyl-2-[(3R)-3-methylmorpholin-4-yl]-8-(1H-pyrazol-5-yl)-1,7-naphthyridine | US10729680, Example 5
Type:
Small organic molecule
Emp. Form.:
C21H22ClN7O
Mol. Mass.:
423.899
SMILES:
C[C@@H]1COCCN1c1cc(-c2cnc(Cl)n2C)c2c(C)cnc(-c3ccn[nH]3)c2n1
: