Target
ATR-interacting protein
Ligand
BDBM453155
Substrate
Meas. Tech.
ATR Activity Assay
IC50
17.9±n/a nM
Citation
 Lücking, UKoppitz, MLefranc, JWortmann, LWengner, AMSiemeister, GBömer, UBader, BLienau, PSchick, H 5-substituted 2-(morpholin-4-yl)-1,7-naphthyridines US Patent  US10729680 Publication Date 8/4/2020 
Target
Name:
ATR-interacting protein
Synonyms:
AGS1 ATR-interacting protein (ATRIP) ATRIP_HUMAN
Type:
Enzyme Catalytic Domain
Mol. Mass.:
85833.30
Organism:
Homo sapiens (Human)
Description:
Q8WXE1
Residue:
791
  
Inhibitor
Name:
BDBM453155
Synonyms:
4-(2,3-dihydro-1,4-benzodioxin-6-yl)-5-methyl-2-[(3R)-3-methylmorpholin-4-yl]-8-(1H- | US10729680, Example 21
Type:
Small organic molecule
Emp. Form.:
C25H25N5O3
Mol. Mass.:
443.4977
SMILES:
C[C@@H]1COCCN1c1cc(-c2ccc3OCCOc3c2)c2c(C)cnc(-c3ccn[nH]3)c2n1
: