Target
ATR-interacting protein
Ligand
BDBM453170
Substrate
Meas. Tech.
ATR Activity Assay
IC50
13.8±n/a nM
Citation
 Lücking, UKoppitz, MLefranc, JWortmann, LWengner, AMSiemeister, GBömer, UBader, BLienau, PSchick, H 5-substituted 2-(morpholin-4-yl)-1,7-naphthyridines US Patent  US10729680 Publication Date 8/4/2020 
Target
Name:
ATR-interacting protein
Synonyms:
AGS1 ATR-interacting protein (ATRIP) ATRIP_HUMAN
Type:
Enzyme Catalytic Domain
Mol. Mass.:
85833.30
Organism:
Homo sapiens (Human)
Description:
Q8WXE1
Residue:
791
  
Inhibitor
Name:
BDBM453170
Synonyms:
4-(2,3-dimethoxyphenyl)-5-methyl-2-[(3R)-3-methylmorpholin-4-yl]-8-(1H-pyrazol-5- | US10729680, Example 37
Type:
Small organic molecule
Emp. Form.:
C25H27N5O3
Mol. Mass.:
445.5136
SMILES:
COc1cccc(c1OC)-c1cc(nc2c(ncc(C)c12)-c1ccn[nH]1)N1CCOC[C@H]1C
: