Target
ATR-interacting protein
Ligand
BDBM453191
Substrate
Meas. Tech.
ATR Activity Assay
IC50
40.0±n/a nM
Citation
 Lücking, UKoppitz, MLefranc, JWortmann, LWengner, AMSiemeister, GBömer, UBader, BLienau, PSchick, H 5-substituted 2-(morpholin-4-yl)-1,7-naphthyridines US Patent  US10729680 Publication Date 8/4/2020 
Target
Name:
ATR-interacting protein
Synonyms:
AGS1 ATR-interacting protein (ATRIP) ATRIP_HUMAN
Type:
Enzyme Catalytic Domain
Mol. Mass.:
85833.30
Organism:
Homo sapiens (Human)
Description:
Q8WXE1
Residue:
791
  
Inhibitor
Name:
BDBM453191
Synonyms:
4-(isoquinolin-4-yl)-5-methyl-2-[(3R)-3-methylmorpholin-4-yl]-8-(1H-pyrazol-5-yl)-1,7- | US10729680, Example 58
Type:
Small organic molecule
Emp. Form.:
C26H24N6O
Mol. Mass.:
436.5084
SMILES:
C[C@@H]1COCCN1c1cc(-c2cncc3ccccc23)c2c(C)cnc(-c3ccn[nH]3)c2n1
: