Target
ATR-interacting protein
Ligand
BDBM453197
Substrate
Meas. Tech.
ATR Activity Assay
IC50
8.60±n/a nM
Citation
 Lücking, UKoppitz, MLefranc, JWortmann, LWengner, AMSiemeister, GBömer, UBader, BLienau, PSchick, H 5-substituted 2-(morpholin-4-yl)-1,7-naphthyridines US Patent  US10729680 Publication Date 8/4/2020 
Target
Name:
ATR-interacting protein
Synonyms:
AGS1 ATR-interacting protein (ATRIP) ATRIP_HUMAN
Type:
Enzyme Catalytic Domain
Mol. Mass.:
85833.30
Organism:
Homo sapiens (Human)
Description:
Q8WXE1
Residue:
791
  
Inhibitor
Name:
BDBM453197
Synonyms:
5-methyl-2-[(3R)-3-methylmorpholin-4-yl]-4-(4-methylpyridin-3-yl)-8-(1H-pyrazol-5- | US10729680, Example 61
Type:
Small organic molecule
Emp. Form.:
C23H24N6O
Mol. Mass.:
400.4763
SMILES:
C[C@@H]1COCCN1c1cc(-c2cnccc2C)c2c(C)cnc(-c3ccn[nH]3)c2n1
: